{"text_format":"1","workbook":"xlsx","n_sheets":9,"sheets":["P_Total","B","P (1)","E","Progr","PomoshtenSheet","Klasif","Inf","P"],"not_rendered":{"charts":0,"images":0,"macros":1,"external_links":0,"defined_names":16,"comments":0,"pivot_tables":0},"unopened":[],"bounds":{"document_bytes":16777216,"sheet_cells":100000,"rows_first":2000,"rows_last":500,"rows_between":2000,"halvings":0,"cell_chars":16384,"cell_head_chars":4096},"cells_cut":0,"cells_raw":0,"read":"whole","date_system":"1900"}

{"sheet":"P_Total","index":0,"n_rows":84,"n_cols":10,"rows_kept":84,"cut":false,"hidden":false,"merged":[]}
[1]
[1,null,"Разшифровка на ведомствените и администрираните разходи по"]
[1,null,"бюджетни програми за 2026 година"]
[1,null,"на Комисия за регулиране на съобщенията"]
[1]
[1]
[1]
[1,null,"П О К А З А Т Е Л И",null,"Закон","Уточнен","Отчет","Отчет","Отчет","Отчет"]
[1,null,null,null,null,"план","към 31 март","към 30 юни","към 30 септември","към 31 декември"]
[1,null,"(в евро)",null,"2026 г.",{"$f":"$E$10","v":"2026 г."},{"$f":"$E$10","v":"2026 г."},{"$f":"$E$10","v":"2026 г."},{"$f":"$E$10","v":"2026 г."},{"$f":"$E$10","v":"2026 г."}]
[1]
[1,null," A",null,1,{"$f":"E12+1","v":2},{"$f":"F12+1","v":3},{"$f":"G12+1","v":4},{"$f":"H12+1","v":5},{"$f":"I12+1","v":6}]
[1]
[1,null,"РАЗХОДИ - ВСИЧКО","02",{"$f":"E16","v":0},0,2009248,5793612,0,0]
[1]
[1,null,"Общо разходи",null,{"$f":"SUBTOTAL(9,E17:E71)","v":0},0,2009248,5793612,0,0]
[1,"1.","Общо ведомствени разходи",null,{"$f":"SUBTOTAL(9,E18:E36)","v":0},0,1959530,5743894,0,0]
[{"$f":"IF(MAX(E18:J18)=0,IF(MIN(E18:J18)=0,3,2),2)","v":2},null,"   Персонал",null,{"$f":"SUBTOTAL(9,E19:E22)","v":0},0,1645601,3476314,0,0]
[2,null,"      Заплати и възнаграждения за персонала, нает по трудови и\n      служебни правоотношения","01-00",{"$f":"SUM(B:E!E19)","v":0},{"$f":"SUM(B:E!F19)","v":0},{"$f":"SUM(B:E!G19)","v":1234341},{"$f":"SUM(B:E!H19)","v":2652148},{"$f":"SUM(B:E!I19)","v":0},{"$f":"SUM(B:E!J19)","v":0}]
[2,null,"      Други възнаграждения и плащания за персонала","02-00",{"$f":"SUM(B:E!E20)","v":0},{"$f":"SUM(B:E!F20)","v":0},{"$f":"SUM(B:E!G20)","v":56299},{"$f":"SUM(B:E!H20)","v":86622},{"$f":"SUM(B:E!I20)","v":0},{"$f":"SUM(B:E!J20)","v":0}]
{"$rows_left_out":65}
{"sheet":"B","index":1,"n_rows":0,"n_cols":0,"rows_kept":0,"cut":false,"hidden":true,"merged":[]}

{"sheet":"P (1)","index":2,"n_rows":84,"n_cols":10,"rows_kept":84,"cut":false,"hidden":false,"merged":[]}
[1]
[1]
[1]
[1,"Код 4300.01.01","Бюджетна програма \"Регулиране не електронните съобщения и пощенските услуги\""]
[1,"Код 4300.01.00","към функционална област \"Електронни съобщения и пощенски услуги\""]
[1]
[1]
[1,null,{"$f":"IF(ISBLANK(P_Total!C8),\" \",P_Total!C8)","v":"П О К А З А Т Е Л И"},{"$f":"IF(ISBLANK(P_Total!D8),\" \",P_Total!D8)","v":" "},{"$f":"IF(ISBLANK(P_Total!E8),\" \",P_Total!E8)","v":"Закон"},{"$f":"IF(ISBLANK(P_Total!F8),\" \",P_Total!F8)","v":"Уточнен"},{"$f":"IF(ISBLANK(P_Total!G8),\" \",P_Total!G8)","v":"Отчет"},{"$f":"IF(ISBLANK(P_Total!H8),\" \",P_Total!H8)","v":"Отчет"},{"$f":"IF(ISBLANK(P_Total!I8),\" \",P_Total!I8)","v":"Отчет"},{"$f":"IF(ISBLANK(P_Total!J8),\" \",P_Total!J8)","v":"Отчет"}]
[1,null,{"$f":"IF(ISBLANK(P_Total!C9),\" \",P_Total!C9)","v":" "},{"$f":"IF(ISBLANK(P_Total!D9),\" \",P_Total!D9)","v":" "},{"$f":"IF(ISBLANK(P_Total!E9),\" \",P_Total!E9)","v":" "},{"$f":"IF(ISBLANK(P_Total!F9),\" \",P_Total!F9)","v":"план"},{"$f":"IF(ISBLANK(P_Total!G9),\" \",P_Total!G9)","v":"към 31 март"},{"$f":"IF(ISBLANK(P_Total!H9),\" \",P_Total!H9)","v":"към 30 юни"},{"$f":"IF(ISBLANK(P_Total!I9),\" \",P_Total!I9)","v":"към 30 септември"},{"$f":"IF(ISBLANK(P_Total!J9),\" \",P_Total!J9)","v":"към 31 декември"}]
[1,null,{"$f":"IF(ISBLANK(P_Total!C10),\" \",P_Total!C10)","v":"(в евро)"},{"$f":"IF(ISBLANK(P_Total!D10),\" \",P_Total!D10)","v":" "},{"$f":"IF(ISBLANK(P_Total!E10),\" \",P_Total!E10)","v":"2026 г."},{"$f":"IF(ISBLANK(P_Total!F10),\" \",P_Total!F10)","v":"2026 г."},{"$f":"IF(ISBLANK(P_Total!G10),\" \",P_Total!G10)","v":"2026 г."},{"$f":"IF(ISBLANK(P_Total!H10),\" \",P_Total!H10)","v":"2026 г."},{"$f":"IF(ISBLANK(P_Total!I10),\" \",P_Total!I10)","v":"2026 г."},{"$f":"IF(ISBLANK(P_Total!J10),\" \",P_Total!J10)","v":"2026 г."}]
[1,null,{"$f":"IF(ISBLANK(P_Total!C11),\" \",P_Total!C11)","v":" "},{"$f":"IF(ISBLANK(P_Total!D11),\" \",P_Total!D11)","v":" "},{"$f":"IF(ISBLANK(P_Total!E11),\" \",P_Total!E11)","v":" "},{"$f":"IF(ISBLANK(P_Total!F11),\" \",P_Total!F11)","v":" "},{"$f":"IF(ISBLANK(P_Total!G11),\" \",P_Total!G11)","v":" "},{"$f":"IF(ISBLANK(P_Total!H11),\" \",P_Total!H11)","v":" "},{"$f":"IF(ISBLANK(P_Total!I11),\" \",P_Total!I11)","v":" "},{"$f":"IF(ISBLANK(P_Total!J11),\" \",P_Total!J11)","v":" "}]
[1,null,{"$f":"IF(ISBLANK(P_Total!C12),\" \",P_Total!C12)","v":" A"},{"$f":"IF(ISBLANK(P_Total!D12),\" \",P_Total!D12)","v":" "},{"$f":"IF(ISBLANK(P_Total!E12),\" \",P_Total!E12)","v":1},{"$f":"IF(ISBLANK(P_Total!F12),\" \",P_Total!F12)","v":2},{"$f":"IF(ISBLANK(P_Total!G12),\" \",P_Total!G12)","v":3},{"$f":"IF(ISBLANK(P_Total!H12),\" \",P_Total!H12)","v":4},{"$f":"IF(ISBLANK(P_Total!I12),\" \",P_Total!I12)","v":5},{"$f":"IF(ISBLANK(P_Total!J12),\" \",P_Total!J12)","v":6}]
[1]
[1,null,"РАЗХОДИ - ВСИЧКО","02",{"$f":"E16","v":0},0,2009248,5793612,0,0]
[1]
[1,null,"Общо разходи",null,{"$f":"SUBTOTAL(9,E17:E71)","v":0},0,2009248,5793612,0,0]
[1,"1.","Общо ведомствени разходи",null,{"$f":"SUBTOTAL(9,E18:E36)","v":0},0,1959530,5743894,0,0]
[{"$f":"IF(MAX(E18:J18)=0,IF(MIN(E18:J18)=0,3,2),2)","v":2},null,"   Персонал",null,{"$f":"SUBTOTAL(9,E19:E22)","v":0},0,1645601,3476314,0,0]
[2,null,"      Заплати и възнаграждения за персонала, нает по трудови и\n      служебни правоотношения","01-00",null,null,1234341,2652148]
[2,null,"      Други възнаграждения и плащания за персонала","02-00",null,null,56299,86622]
{"$rows_left_out":65}
{"sheet":"E","index":3,"n_rows":0,"n_cols":0,"rows_kept":0,"cut":false,"hidden":true,"merged":[]}

{"sheet":"Progr","index":4,"n_rows":47,"n_cols":11,"rows_kept":47,"cut":false,"hidden":false,"merged":[]}
[1]
[1,null,null,"Обобщена справка за разходите по бюджетни програми"]
[1]
[1,null,null,{"$f":"P_Total!C4","v":"на Комисия за регулиране на съобщенията"}]
[1]
[1]
[1]
[1,null,"Код","Наименование на бюджетните програми",{"$f":"IF(ISBLANK(P_Total!D8),\" \",P_Total!D8)","v":" "},{"$f":"IF(ISBLANK(P_Total!E8),\" \",P_Total!E8)","v":"Закон"},{"$f":"IF(ISBLANK(P_Total!F8),\" \",P_Total!F8)","v":"Уточнен"},{"$f":"IF(ISBLANK(P_Total!G8),\" \",P_Total!G8)","v":"Отчет"},{"$f":"IF(ISBLANK(P_Total!H8),\" \",P_Total!H8)","v":"Отчет"},{"$f":"IF(ISBLANK(P_Total!I8),\" \",P_Total!I8)","v":"Отчет"},{"$f":"IF(ISBLANK(P_Total!J8),\" \",P_Total!J8)","v":"Отчет"}]
[1,null,null,{"$f":"IF(ISBLANK(P_Total!C9),\" \",P_Total!C9)","v":" "},{"$f":"IF(ISBLANK(P_Total!D9),\" \",P_Total!D9)","v":" "},{"$f":"IF(ISBLANK(P_Total!E9),\" \",P_Total!E9)","v":" "},{"$f":"IF(ISBLANK(P_Total!F9),\" \",P_Total!F9)","v":"план"},{"$f":"IF(ISBLANK(P_Total!G9),\" \",P_Total!G9)","v":"към 31 март"},{"$f":"IF(ISBLANK(P_Total!H9),\" \",P_Total!H9)","v":"към 30 юни"},{"$f":"IF(ISBLANK(P_Total!I9),\" \",P_Total!I9)","v":"към 30 септември"},{"$f":"IF(ISBLANK(P_Total!J9),\" \",P_Total!J9)","v":"към 31 декември"}]
[1,null,null,{"$f":"IF(ISBLANK(P_Total!C10),\" \",P_Total!C10)","v":"(в евро)"},{"$f":"IF(ISBLANK(P_Total!D10),\" \",P_Total!D10)","v":" "},{"$f":"IF(ISBLANK(P_Total!E10),\" \",P_Total!E10)","v":"2026 г."},{"$f":"IF(ISBLANK(P_Total!F10),\" \",P_Total!F10)","v":"2026 г."},{"$f":"IF(ISBLANK(P_Total!G10),\" \",P_Total!G10)","v":"2026 г."},{"$f":"IF(ISBLANK(P_Total!H10),\" \",P_Total!H10)","v":"2026 г."},{"$f":"IF(ISBLANK(P_Total!I10),\" \",P_Total!I10)","v":"2026 г."},{"$f":"IF(ISBLANK(P_Total!J10),\" \",P_Total!J10)","v":"2026 г."}]
[1,null,null,{"$f":"IF(ISBLANK(P_Total!C11),\" \",P_Total!C11)","v":" "},{"$f":"IF(ISBLANK(P_Total!D11),\" \",P_Total!D11)","v":" "},{"$f":"IF(ISBLANK(P_Total!E11),\" \",P_Total!E11)","v":" "},{"$f":"IF(ISBLANK(P_Total!F11),\" \",P_Total!F11)","v":" "},{"$f":"IF(ISBLANK(P_Total!G11),\" \",P_Total!G11)","v":" "},{"$f":"IF(ISBLANK(P_Total!H11),\" \",P_Total!H11)","v":" "},{"$f":"IF(ISBLANK(P_Total!I11),\" \",P_Total!I11)","v":" "},{"$f":"IF(ISBLANK(P_Total!J11),\" \",P_Total!J11)","v":" "}]
[1,null,null,{"$f":"IF(ISBLANK(P_Total!C12),\" \",P_Total!C12)","v":" A"},{"$f":"IF(ISBLANK(P_Total!D12),\" \",P_Total!D12)","v":" "},{"$f":"IF(ISBLANK(P_Total!E12),\" \",P_Total!E12)","v":1},{"$f":"IF(ISBLANK(P_Total!F12),\" \",P_Total!F12)","v":2},{"$f":"IF(ISBLANK(P_Total!G12),\" \",P_Total!G12)","v":3},{"$f":"IF(ISBLANK(P_Total!H12),\" \",P_Total!H12)","v":4},{"$f":"IF(ISBLANK(P_Total!I12),\" \",P_Total!I12)","v":5},{"$f":"IF(ISBLANK(P_Total!J12),\" \",P_Total!J12)","v":6}]
[1]
[1,null,null,"ОБЩО РАЗХОДИ",null,{"$f":"P_Total!E$14","v":0},{"$f":"P_Total!F$14","v":0},{"$f":"P_Total!G$14","v":2009248},{"$f":"P_Total!H$14","v":5793612},{"$f":"P_Total!I$14","v":0},{"$f":"P_Total!J$14","v":0}]
[1,null,null,null,null,{"$f":"F14-F16","v":0},0,0,0,0,0]
[1,null,null,"Разходи по бюджетни програми",null,{"$f":"SUBTOTAL(9,F17:F47)","v":0},0,2009248,5793612,0,0]
[{"$f":"IF(AND(MAX(F17:K17)=0,MIN(F17:K17)=0,C17=\" \"),3,2)","v":2},"P (1)",{"$f":"IF($E17=0,\" \",'P (1)'!B$4)","v":"Код 4300.01.01"},{"$f":"IF($E17=0,\" \",'P (1)'!C$4)","v":"Бюджетна програма \"Регулиране не електронните съобщения и пощенските услуги\""},{"$f":"VLOOKUP($B17,Inf!$B$11:$C$40,2,FALSE)","v":1},{"$f":"IF($E17=0,0,'P (1)'!E$14)","v":0},{"$f":"IF($E17=0,0,'P (1)'!F$14)","v":0},{"$f":"IF($E17=0,0,'P (1)'!G$14)","v":2009248},{"$f":"IF($E17=0,0,'P (1)'!H$14)","v":5793612},{"$f":"IF($E17=0,0,'P (1)'!I$14)","v":0},{"$f":"IF($E17=0,0,'P (1)'!J$14)","v":0}]
[{"$f":"IF(AND(MAX(F18:K18)=0,MIN(F18:K18)=0,C18=\" \"),3,2)","v":3},"P (2)",{"$f":"IF($E18=0,\" \",P!B$4)","v":" "},{"$f":"IF($E18=0,\" \",P!C$4)","v":" "},{"$f":"VLOOKUP($B18,Inf!$B$11:$C$40,2,FALSE)","v":0},{"$f":"IF($E18=0,0,P!E$14)","v":0},{"$f":"IF($E18=0,0,P!F$14)","v":0},{"$f":"IF($E18=0,0,P!G$14)","v":0},{"$f":"IF($E18=0,0,P!H$14)","v":0},{"$f":"IF($E18=0,0,P!I$14)","v":0},{"$f":"IF($E18=0,0,P!J$14)","v":0}]
[3,"P (3)",{"$f":"IF($E19=0,\" \",P!B$4)","v":" "},{"$f":"IF($E19=0,\" \",P!C$4)","v":" "},{"$f":"VLOOKUP($B19,Inf!$B$11:$C$40,2,FALSE)","v":0},{"$f":"IF($E19=0,0,P!E$14)","v":0},{"$f":"IF($E19=0,0,P!F$14)","v":0},{"$f":"IF($E19=0,0,P!G$14)","v":0},{"$f":"IF($E19=0,0,P!H$14)","v":0},{"$f":"IF($E19=0,0,P!I$14)","v":0},{"$f":"IF($E19=0,0,P!J$14)","v":0}]
[3,"P (4)",{"$f":"IF($E20=0,\" \",P!B$4)","v":" "},{"$f":"IF($E20=0,\" \",P!C$4)","v":" "},{"$f":"VLOOKUP($B20,Inf!$B$11:$C$40,2,FALSE)","v":0},{"$f":"IF($E20=0,0,P!E$14)","v":0},{"$f":"IF($E20=0,0,P!F$14)","v":0},{"$f":"IF($E20=0,0,P!G$14)","v":0},{"$f":"IF($E20=0,0,P!H$14)","v":0},{"$f":"IF($E20=0,0,P!I$14)","v":0},{"$f":"IF($E20=0,0,P!J$14)","v":0}]
{"$rows_left_out":28}
{"sheet":"PomoshtenSheet","index":5,"n_rows":63,"n_cols":10,"rows_kept":63,"cut":false,"hidden":false,"merged":[]}
[1]
[1,null,"Помощен Sheet - Сумата на разходите от всички програми (от Sheet P_Total) по параграфи - за сравнение с отчета по ЕБК (за проверка)."]
[1]
[1,null,"Сумата на разходите от всички програми по определен показател трябва да съответства на размера на същият показател от отчета по ЕБК."]
[1]
[1]
[1]
[1,null,"П О К А З А Т Е Л И",null,{"$f":"IF(ISBLANK(P_Total!E8),\" \",P_Total!E8)","v":"Закон"},{"$f":"IF(ISBLANK(P_Total!F8),\" \",P_Total!F8)","v":"Уточнен"},{"$f":"IF(ISBLANK(P_Total!G8),\" \",P_Total!G8)","v":"Отчет"},{"$f":"IF(ISBLANK(P_Total!H8),\" \",P_Total!H8)","v":"Отчет"},{"$f":"IF(ISBLANK(P_Total!I8),\" \",P_Total!I8)","v":"Отчет"},{"$f":"IF(ISBLANK(P_Total!J8),\" \",P_Total!J8)","v":"Отчет"}]
[1,null,null,null,{"$f":"IF(ISBLANK(P_Total!E9),\" \",P_Total!E9)","v":" "},{"$f":"IF(ISBLANK(P_Total!F9),\" \",P_Total!F9)","v":"план"},{"$f":"IF(ISBLANK(P_Total!G9),\" \",P_Total!G9)","v":"към 31 март"},{"$f":"IF(ISBLANK(P_Total!H9),\" \",P_Total!H9)","v":"към 30 юни"},{"$f":"IF(ISBLANK(P_Total!I9),\" \",P_Total!I9)","v":"към 30 септември"},{"$f":"IF(ISBLANK(P_Total!J9),\" \",P_Total!J9)","v":"към 31 декември"}]
[1,null,{"$f":"P_Total!C10","v":"(в евро)"},null,{"$f":"IF(ISBLANK(P_Total!E10),\" \",P_Total!E10)","v":"2026 г."},{"$f":"IF(ISBLANK(P_Total!F10),\" \",P_Total!F10)","v":"2026 г."},{"$f":"IF(ISBLANK(P_Total!G10),\" \",P_Total!G10)","v":"2026 г."},{"$f":"IF(ISBLANK(P_Total!H10),\" \",P_Total!H10)","v":"2026 г."},{"$f":"IF(ISBLANK(P_Total!I10),\" \",P_Total!I10)","v":"2026 г."},{"$f":"IF(ISBLANK(P_Total!J10),\" \",P_Total!J10)","v":"2026 г."}]
[1,null,null,null,{"$f":"IF(ISBLANK(P_Total!E11),\" \",P_Total!E11)","v":" "},{"$f":"IF(ISBLANK(P_Total!F11),\" \",P_Total!F11)","v":" "},{"$f":"IF(ISBLANK(P_Total!G11),\" \",P_Total!G11)","v":" "},{"$f":"IF(ISBLANK(P_Total!H11),\" \",P_Total!H11)","v":" "},{"$f":"IF(ISBLANK(P_Total!I11),\" \",P_Total!I11)","v":" "},{"$f":"IF(ISBLANK(P_Total!J11),\" \",P_Total!J11)","v":" "}]
[1,null," A",null,{"$f":"IF(ISBLANK(P_Total!E12),\" \",P_Total!E12)","v":1},{"$f":"IF(ISBLANK(P_Total!F12),\" \",P_Total!F12)","v":2},{"$f":"IF(ISBLANK(P_Total!G12),\" \",P_Total!G12)","v":3},{"$f":"IF(ISBLANK(P_Total!H12),\" \",P_Total!H12)","v":4},{"$f":"IF(ISBLANK(P_Total!I12),\" \",P_Total!I12)","v":5},{"$f":"IF(ISBLANK(P_Total!J12),\" \",P_Total!J12)","v":6}]
[1,null,null,null,{"$f":"P_Total!E14-PomoshtenSheet!E14","v":0},{"$f":"P_Total!F14-PomoshtenSheet!F14","v":0},{"$f":"P_Total!G14-PomoshtenSheet!G14","v":0},{"$f":"P_Total!H14-PomoshtenSheet!H14","v":0},{"$f":"P_Total!I14-PomoshtenSheet!I14","v":0},{"$f":"P_Total!J14-PomoshtenSheet!J14","v":0}]
[1,null,"II. РАЗХОДИ - ВСИЧКО","02",{"$f":"E16","v":0},0,2009248,5793612,0,0]
[1]
[{"$f":"IF(MAX(E16:J16)=0,IF(MIN(E16:J16)=0,3,2),2)","v":2},null,"Общо разходи",null,{"$f":"SUBTOTAL(9,E17:E50)","v":0},0,2009248,5793612,0,0]
[2," 1.","Текущи разходи",null,{"$f":"SUBTOTAL(9,E18:E36)","v":0},0,2004546,4242071,0,0]
[2,null,"Персонал",null,{"$f":"SUBTOTAL(9,E19:E22)","v":0},0,1645601,3476314,0,0]
[2,null,"Заплати и възнаграждения за персонала, нает по трудови и служебни правоотношения","01-00",{"$f":"P_Total!E19+P_Total!E40","v":0},{"$f":"P_Total!F19+P_Total!F40","v":0},{"$f":"P_Total!G19+P_Total!G40","v":1234341},{"$f":"P_Total!H19+P_Total!H40","v":2652148},{"$f":"P_Total!I19+P_Total!I40","v":0},{"$f":"P_Total!J19+P_Total!J40","v":0}]
[2,null,"Други възнаграждения и плащания за персонала","02-00",{"$f":"P_Total!E20+P_Total!E41","v":0},{"$f":"P_Total!F20+P_Total!F41","v":0},{"$f":"P_Total!G20+P_Total!G41","v":56299},{"$f":"P_Total!H20+P_Total!H41","v":86622},{"$f":"P_Total!I20+P_Total!I41","v":0},{"$f":"P_Total!J20+P_Total!J41","v":0}]
{"$rows_left_out":44}
{"sheet":"Klasif","index":6,"n_rows":383,"n_cols":3,"rows_kept":383,"cut":false,"hidden":false,"merged":[[0,1,0,2],[1,1,1,2],[382,1,382,2]]}
[null,"КЛАСИФИКАЦИЯ"]
[null,"на областите на политики/функционалните области и бюджетните програми от компетентността и отговорността на съответния първостепенен разпоредител с бюджет, чийто бюджет се включва в държавния бюджет, с изключение на първостепенните разпоредители с бюджет по бюджетите на Народното събрание и на съдебната власт"]
[]
[null,"Код*","Област на политика/Функционална област/Бюджетна програма"]
[]
[null," 0200.00.00","АДМИНИСТРАЦИЯ НА ПРЕЗИДЕНТА"]
[null," 0200.01.00","Функционална област „Осъществяване на конституционните правомощия на президента на Република България“"]
[null," 0200.01.01","Бюджетна програма „Подпомагане и осигуряване дейността на президента и вицепрезидента на Република България при изпълнение на конституционните и законовите им правомощия“"]
[null," "]
[null," 0300.00.00","МИНИСТЕРСКИ СЪВЕТ"]
[null," 0300.01.00","Област „Осигуряване дейността и организацията на работата на Министерския съвет“"]
[null," 0300.01.01","Бюджетна програма „Министерски съвет и организация на дейността му“"]
[null," 0300.01.02","Бюджетна програма „Координация и мониторинг на хоризонтални политики“"]
[null," 0300.02.00","Политика в областта на управлението на средствата от ЕС"]
[null," 0300.02.01","Бюджетна програма „Координация при управление на средствата от ЕС“"]
[null," 0300.03.00","Политика в областта на осъществяването на държавните функции на територията на областите в България"]
[null," 0300.03.01","Бюджетна програма „Осъществяване на държавната политика на областно ниво“"]
[null," 0300.04.00","Политика в областта на правото на вероизповедание"]
[null," 0300.04.01","Бюджетна програма „Вероизповедания“"]
[null," 0300.05.00","Политика в областта на архивното дело"]
{"$rows_left_out":364}
{"sheet":"Inf","index":7,"n_rows":40,"n_cols":3,"rows_kept":40,"cut":false,"hidden":true,"merged":[]}
[2,2,{"$f":"SUM(C11:C40)","v":1}]
["Hide Rows"]
["All Rows"]
[]
[]
["Hide Columns"]
["All Columns"]
[]
[]
[]
[null,"P (1)",1]
[null,"P (2)"]
[null,"P (3)"]
[null,"P (4)"]
[null,"P (5)"]
[null,"P (6)"]
[null,"P (7)"]
[null,"P (8)"]
[null,"P (9)"]
[null,"P (10)"]
{"$rows_left_out":21}
{"sheet":"P","index":8,"n_rows":84,"n_cols":10,"rows_kept":84,"cut":false,"hidden":true,"merged":[]}
[1]
[1]
[1]
[1,"Код …","Бюджетна програма ................................................................................"]
[1,"Код …","към Област на политика/функционална област ..................................."]
[1]
[1]
[1,null,{"$f":"IF(ISBLANK(P_Total!C8),\" \",P_Total!C8)","v":"П О К А З А Т Е Л И"},{"$f":"IF(ISBLANK(P_Total!D8),\" \",P_Total!D8)","v":" "},{"$f":"IF(ISBLANK(P_Total!E8),\" \",P_Total!E8)","v":"Закон"},{"$f":"IF(ISBLANK(P_Total!F8),\" \",P_Total!F8)","v":"Уточнен"},{"$f":"IF(ISBLANK(P_Total!G8),\" \",P_Total!G8)","v":"Отчет"},{"$f":"IF(ISBLANK(P_Total!H8),\" \",P_Total!H8)","v":"Отчет"},{"$f":"IF(ISBLANK(P_Total!I8),\" \",P_Total!I8)","v":"Отчет"},{"$f":"IF(ISBLANK(P_Total!J8),\" \",P_Total!J8)","v":"Отчет"}]
[1,null,{"$f":"IF(ISBLANK(P_Total!C9),\" \",P_Total!C9)","v":" "},{"$f":"IF(ISBLANK(P_Total!D9),\" \",P_Total!D9)","v":" "},{"$f":"IF(ISBLANK(P_Total!E9),\" \",P_Total!E9)","v":" "},{"$f":"IF(ISBLANK(P_Total!F9),\" \",P_Total!F9)","v":"план"},{"$f":"IF(ISBLANK(P_Total!G9),\" \",P_Total!G9)","v":"към 31 март"},{"$f":"IF(ISBLANK(P_Total!H9),\" \",P_Total!H9)","v":"към 30 юни"},{"$f":"IF(ISBLANK(P_Total!I9),\" \",P_Total!I9)","v":"към 30 септември"},{"$f":"IF(ISBLANK(P_Total!J9),\" \",P_Total!J9)","v":"към 31 декември"}]
[1,null,{"$f":"IF(ISBLANK(P_Total!C10),\" \",P_Total!C10)","v":"(в евро)"},{"$f":"IF(ISBLANK(P_Total!D10),\" \",P_Total!D10)","v":" "},{"$f":"IF(ISBLANK(P_Total!E10),\" \",P_Total!E10)","v":"2026 г."},{"$f":"IF(ISBLANK(P_Total!F10),\" \",P_Total!F10)","v":"2026 г."},{"$f":"IF(ISBLANK(P_Total!G10),\" \",P_Total!G10)","v":"2026 г."},{"$f":"IF(ISBLANK(P_Total!H10),\" \",P_Total!H10)","v":"2026 г."},{"$f":"IF(ISBLANK(P_Total!I10),\" \",P_Total!I10)","v":"2026 г."},{"$f":"IF(ISBLANK(P_Total!J10),\" \",P_Total!J10)","v":"2026 г."}]
[1,null,{"$f":"IF(ISBLANK(P_Total!C11),\" \",P_Total!C11)","v":" "},{"$f":"IF(ISBLANK(P_Total!D11),\" \",P_Total!D11)","v":" "},{"$f":"IF(ISBLANK(P_Total!E11),\" \",P_Total!E11)","v":" "},{"$f":"IF(ISBLANK(P_Total!F11),\" \",P_Total!F11)","v":" "},{"$f":"IF(ISBLANK(P_Total!G11),\" \",P_Total!G11)","v":" "},{"$f":"IF(ISBLANK(P_Total!H11),\" \",P_Total!H11)","v":" "},{"$f":"IF(ISBLANK(P_Total!I11),\" \",P_Total!I11)","v":" "},{"$f":"IF(ISBLANK(P_Total!J11),\" \",P_Total!J11)","v":" "}]
[1,null,{"$f":"IF(ISBLANK(P_Total!C12),\" \",P_Total!C12)","v":" A"},{"$f":"IF(ISBLANK(P_Total!D12),\" \",P_Total!D12)","v":" "},{"$f":"IF(ISBLANK(P_Total!E12),\" \",P_Total!E12)","v":1},{"$f":"IF(ISBLANK(P_Total!F12),\" \",P_Total!F12)","v":2},{"$f":"IF(ISBLANK(P_Total!G12),\" \",P_Total!G12)","v":3},{"$f":"IF(ISBLANK(P_Total!H12),\" \",P_Total!H12)","v":4},{"$f":"IF(ISBLANK(P_Total!I12),\" \",P_Total!I12)","v":5},{"$f":"IF(ISBLANK(P_Total!J12),\" \",P_Total!J12)","v":6}]
[1]
[1,null,"РАЗХОДИ - ВСИЧКО","02",{"$f":"E16","v":0},0,0,0,0,0]
[1]
[1,null,"Общо разходи",null,{"$f":"SUBTOTAL(9,E17:E71)","v":0},0,0,0,0,0]
[1,"1.","Общо ведомствени разходи",null,{"$f":"SUBTOTAL(9,E18:E36)","v":0},0,0,0,0,0]
[{"$f":"IF(MAX(E18:J18)=0,IF(MIN(E18:J18)=0,3,2),2)","v":3},null,"   Персонал",null,{"$f":"SUBTOTAL(9,E19:E22)","v":0},0,0,0,0,0]
[3,null,"      Заплати и възнаграждения за персонала, нает по трудови и\n      служебни правоотношения","01-00"]
[3,null,"      Други възнаграждения и плащания за персонала","02-00"]
{"$rows_left_out":64}